{"text_format":"1","workbook":"xlsx","n_sheets":2,"sheets":["B16 Si Main Draw Prep","MEN 14-34 Main 64"],"not_rendered":{"charts":0,"images":2,"macros":1,"external_links":0,"defined_names":17,"comments":2,"pivot_tables":0},"unopened":[],"bounds":{"document_bytes":16777216,"sheet_cells":100000,"rows_first":2000,"rows_last":500,"rows_between":2000,"halvings":0,"cell_chars":16384,"cell_head_chars":4096},"cells_cut":0,"cells_raw":0,"read":"whole","date_system":"1900"}

{"sheet":"B16 Si Main Draw Prep","index":0,"n_rows":134,"n_cols":19,"rows_kept":134,"cut":false,"hidden":false,"merged":[[4,0,4,1]]}
[{"$f":"#REF!","v":{"$error":"#REF!"}},null,null,"B16","BOYS U16 SINGLES MAIN DRAW"]
[{"$f":"#REF!","v":{"$error":"#REF!"}},null,null,null,"PREPARATION LIST"]
["DO NO DELETE THIS PAGE IF YOU ARE USING LINK-IN'S TO THE DRAW",null,null,null,null,null,null,null,null,null,null,null,null,null,"Referee's signature"]
["Week of",null,"City, Country","Category",null,null,null,null,null,"Referee"]
[{"$f":"#REF!","v":{"$error":"#REF!"}},null,{"$f":"#REF!","v":{"$error":"#REF!"}},{"$f":"#REF!","v":{"$error":"#REF!"}},null,null,null,null,null,{"$f":"#REF!","v":{"$error":"#REF!"}},null,null,null,null,null,null,null,{"$f":"COUNTA(R7:R134)","v":0}]
["Line","Family name","First name","Nat.","Date of birth Day/Mth/Yr","On\nAccept. list\nYes","Signed-in\nYes","EUR 16\nAccept.\nRanking","Pro-\nRanking","National\nAccept\nPriority","NatSort\nif not \nSeed","NatSort","Seed Sort","AccBasic","Accept status","EUR 16\nSeed\nRanking","AccSort","Seed\nPosition","National\nTop 1-4"]
[1,"ΠΑΠΑΓΕΩΡΓΙΟΥ","ΔΗΜΗΤΡΙΟΣ",null,null,null,null,null,null,null,{"$f":"IF(AND(R7=\"\",S7>0,S7<5),L7,)","v":0},{"$f":"IF(D7=\"\",\"ZZZ9\",IF(AND(S7>0,S7<5),D7&S7,D7&\"9\"))","v":"ZZZ9"},{"$f":"IF(R7=\"\",999,R7)","v":999},{"$f":"IF(Q7=999,999,1)","v":999},null,null,{"$f":"IF(O7=\"DA\",1,IF(O7=\"WC\",2,IF(O7=\"SE\",3,IF(O7=\"Q\",4,IF(O7=\"LL\",5,999)))))","v":999}]
[2,"ΚΑΡΑΝΑΓΝΩΣΤΗΣ","ΚΩΝΣΤΑΝΤΙΝΟΣ",null,null,null,null,null,null,null,{"$f":"IF(AND(R8=\"\",S8>0,S8<5),L8,)","v":0},{"$f":"IF(D8=\"\",\"ZZZ9\",IF(AND(S8>0,S8<5),D8&S8,D8&\"9\"))","v":"ZZZ9"},{"$f":"IF(R8=\"\",999,R8)","v":999},{"$f":"IF(Q8=999,999,1)","v":999},null,null,{"$f":"IF(O8=\"DA\",1,IF(O8=\"WC\",2,IF(O8=\"SE\",3,IF(O8=\"Q\",4,IF(O8=\"LL\",5,999)))))","v":999}]
[3,"ΛΑΜΠΡΟΠΟΥΛΟΣ","ΚΛΕΜ",null,null,null,null,null,null,null,0,{"$f":"IF(#REF!=\"\",\"ZZZ9\",IF(AND(S9>0,S9<5),#REF!&S9,#REF!&\"9\"))","v":{"$error":"#REF!"}},999,999,null,null,{"$f":"IF(O9=\"DA\",1,IF(O9=\"WC\",2,IF(O9=\"SE\",3,IF(O9=\"Q\",4,IF(O9=\"LL\",5,999)))))","v":999}]
[4,"ΠΑΝΑΓΙΩΤΟΠΟΥΛΟΣ","ΘΕΟΔΩΡΟΣ",null,null,null,null,null,null,null,0,{"$f":"IF(D9=\"\",\"ZZZ9\",IF(AND(S10>0,S10<5),D9&S10,D9&\"9\"))","v":"ZZZ9"},999,999,null,null,{"$f":"IF(O10=\"DA\",1,IF(O10=\"WC\",2,IF(O10=\"SE\",3,IF(O10=\"Q\",4,IF(O10=\"LL\",5,999)))))","v":999}]
[5,"ΑΝΑΣΤΟΠΟΥΛΟΣ","ΠΑΝΑΓΙΩΤΗΣ",null,null,null,null,null,null,null,0,"ZZZ9",999,999,null,null,{"$f":"IF(O11=\"DA\",1,IF(O11=\"WC\",2,IF(O11=\"SE\",3,IF(O11=\"Q\",4,IF(O11=\"LL\",5,999)))))","v":999}]
[6,"ΑΝΑΣΤΟΠΟΥΛΟΣ","ΝΙΚΟΛΑΟΣ",null,null,null,null,null,null,null,0,"ZZZ9",999,999,null,null,{"$f":"IF(O12=\"DA\",1,IF(O12=\"WC\",2,IF(O12=\"SE\",3,IF(O12=\"Q\",4,IF(O12=\"LL\",5,999)))))","v":999}]
[7,"ΚΑΝΤΖΑΒΕΛΟΣ","ΜΙΧΑΛΗΣ",null,null,null,null,null,null,null,0,"ZZZ9",999,999,null,null,999]
[8,"ΤΖΙΝΗΣ","ΝΙΚΟΛΑΟΣ",null,null,null,null,null,null,null,0,"ZZZ9",999,999,null,null,999]
[9,"ΜΠΟΖΙΟΣ","ΝΙΚΟΛΑΟΣ",null,null,null,null,null,null,null,0,"ZZZ9",999,999,null,null,999]
[10,"ΠΑΤΡΙΝΕΛΗΣ","ΦΩΤΗΣ",null,null,null,null,null,null,null,0,"ZZZ9",999,999,null,null,999]
[11,"ΚΑΝΕΛΛΟΠΟΥΛΟΣ","ΠΕΤΡΟΣ",null,null,null,null,null,null,null,0,{"$f":"IF(#REF!=\"\",\"ZZZ9\",IF(AND(S17>0,S17<5),#REF!&S17,#REF!&\"9\"))","v":{"$error":"#REF!"}},999,999,null,null,999]
[12,"ΠΑΠΑΝΙΚΟΛΑΟΥ","ΕΚΤΩΡΑΣ",null,null,null,null,null,null,null,0,{"$f":"IF(#REF!=\"\",\"ZZZ9\",IF(AND(S18>0,S18<5),#REF!&S18,#REF!&\"9\"))","v":{"$error":"#REF!"}},999,999,null,null,999]
[13,"ΛΕΡΙΚΟΣ","ΑΡΗΣ",null,null,null,null,null,null,null,0,{"$f":"IF(D16=\"\",\"ZZZ9\",IF(AND(S19>0,S19<5),D16&S19,D16&\"9\"))","v":"ZZZ9"},999,999,null,null,999]
[14,"ΣΔΡΑΚΑΣ","ΘΑΝΑΣΗΣ",null,null,null,null,null,null,null,0,{"$f":"IF(D17=\"\",\"ZZZ9\",IF(AND(S20>0,S20<5),D17&S20,D17&\"9\"))","v":"ZZZ9"},999,999,null,null,999]
[15,"ΝΙΚΟΛΟΠΟΥΛΟΣ","ΧΡΗΣΤΟΣ",null,null,null,null,null,null,null,0,{"$f":"IF(D18=\"\",\"ZZZ9\",IF(AND(S21>0,S21<5),D18&S21,D18&\"9\"))","v":"ZZZ9"},999,999,null,null,999]
[16,"ΓΙΑΝΝΟΠΟΥΛΟΣ","ΒΑΣΙΛΗΣ",null,null,null,null,null,null,null,0,{"$f":"IF(D19=\"\",\"ZZZ9\",IF(AND(S22>0,S22<5),D19&S22,D19&\"9\"))","v":"ZZZ9"},999,999,null,null,999]
[17,"ΛΑΛΟΥΣΗΣ","ΚΟΣΜΑΣ",null,null,null,null,null,null,null,0,{"$f":"IF(D20=\"\",\"ZZZ9\",IF(AND(S23>0,S23<5),D20&S23,D20&\"9\"))","v":"ZZZ9"},999,999,null,null,999]
[18,"ΠΑΠΑΒΑΣΙΛΕΙΟΥ","ΣΤΑΥΡΟΣ",null,null,null,null,null,null,null,0,"ZZZ9",999,999,null,null,999]
[19,"ΧΡΙΣΤΟΠΟΥΛΟΣ","ΧΡΗΣΤΟΣ",null,null,null,null,null,null,null,0,"ZZZ9",999,999,null,null,999]
[20,"ΚΑΤΣΙΧΤΗΣ","ΠΑΝΑΓΙΩΤΗΣ",null,null,null,null,null,null,null,0,"ZZZ9",999,999,null,null,999]
[21,"ΣΓΟΥΠΑΚΟΣ","ΠΑΝΑΓΙΩΤΗΣ",null,null,null,null,null,null,null,0,"ZZZ9",999,999,null,null,999]
[22,"ΓΙΑΝΝΑΚΟΠΟΥΛΟΣ","ΓΙΑΝΝΗΣ",null,null,null,null,null,null,null,0,"ZZZ9",999,999,null,null,999]
[23,"ΘΗΒΑΙΟΣ","ΓΙΑΝΝΗΣ",null,null,null,null,null,null,null,0,"ZZZ9",999,999,null,null,999]
[24,"ΔΟΥΚΟΥΜΟΠΟΥΛΟΣ","ΔΗΜΗΤΡΙΟΣ",null,null,null,null,null,null,null,0,"ZZZ9",999,999,null,null,999]
[25,"ΓΕΡΟΔΗΜΟΣ","ΑΠΟΣΤΟΛΟΣ",null,null,null,null,null,null,null,0,"ZZZ9",999,999,null,null,999]
[26,"ΣΠΥΡΑΚΗΣ","ΓΙΩΡΓΟΣ",null,null,null,null,null,null,null,0,"ZZZ9",999,999,null,null,999]
[27,"ΓΙΑΝΝΑΚΟΠΟΥΛΟΣ","ΔΗΜΗΤΡΗΣ",null,null,null,null,null,null,null,0,"ZZZ9",999,999,null,null,999]
[28,"ΓΑΛΑΝΗΣ","ΝΙΚΟΣ",null,null,null,null,null,null,null,0,"ZZZ9",999,999,null,null,999]
[29,"ΚΑΡΕΛΑΣ","ΠΑΝΑΓΙΩΤΗΣ",null,null,null,null,null,null,null,0,"ZZZ9",999,999,null,null,999]
[30,"ΠΑΠΑΝΙΚΟΛΑΟΥ","ΝΤΥΛΑΝ",null,null,null,null,null,null,null,0,"ZZZ9",999,999,null,null,999]
[31,"ΤΣΟΥΚΛΕΡΗΣ","ΓΙΩΡΓΟΣ",null,null,null,null,null,null,null,0,"ZZZ9",999,999,null,null,999]
[32,"ΖΙΤΣΑΣ","ΓΙΩΡΓΟΣ",null,null,null,null,null,null,null,0,"ZZZ9",999,999,null,null,999]
[33,"ΧΙΩΤΗΣ","ΠΑΝΑΓΙΩΤΗΣ",null,null,null,null,null,null,null,0,"ZZZ9",999,999,null,null,999]
[34,"ΔΙΑΜΑΝΤΟΠΟΥΛΟΣ","ΠΑΝΑΓΙΩΤΗΣ",null,null,null,null,null,null,null,0,"ZZZ9",999,999,null,null,999]
{"$rows_left_out":95}
{"sheet":"MEN 14-34 Main 64","index":1,"n_rows":80,"n_cols":20,"rows_kept":80,"cut":false,"hidden":false,"merged":[[3,0,3,2]]}
["ΚΟΛΟΚΟΤΡΩΝΕΙΑ 2017",null,null,null,null,null,null,null,null,null,null,null,null,"CU"]
["TRIPOLIS TENNIS OPEN",null,null,null,null,null,"MEN 14-34  MAIN DRAW (64)"]
["Week of",null,null,null,null,"City, Country",null,null,null,null,null,"Tourn. ID",null,null,null,null,"ITF Referee"]
[null,null,null,null,null,"ΤΡΙΠΟΛΗ - AEK ΤΡΙΠΟΛΗΣ",null,null,null,null,null,"OPEN",null,"ΠΑΠΑΔΟΠΟΥΛΟΣ - ΧΑΤΖΗΓΙΑΝΝΗ"]
[null,"St.","Rank","Seed","Family Name","First name",null,"Nationality",null,"2nd Round",null,"3rd Round",null,"Quarterfinals",null,"Semifinals"]
[]
["1",{"$f":"IF($D7=\"\",\"\",VLOOKUP($D7,'B16 Si Main Draw Prep'!$A$7:$P$70,15))","v":""},{"$f":"IF($D7=\"\",\"\",VLOOKUP($D7,'B16 Si Main Draw Prep'!$A$7:$P$70,16))","v":""},null,"ΧΡIΣΤΟΠΟΥΛΟΣ ΧΡΗΣΤΟΣ",{"$f":"IF($D7=\"\",\"\",VLOOKUP($D7,'B16 Si Main Draw Prep'!$A$7:$P$70,3))","v":""},null,{"$f":"IF($D7=\"\",\"\",VLOOKUP($D7,'B16 Si Main Draw Prep'!$A$7:$P$70,4))","v":""},null,{"$f":"UPPER(IF(OR(I8=\"a\",I8=\"as\"),E7,IF(OR(I8=\"b\",I8=\"bs\"),E8,)))","v":"ΧΡIΣΤΟΠΟΥΛΟΣ ΧΡΗΣΤΟΣ"},null,null,null,null,null,null,null,null,null,{"$f":"#REF!","v":{"$error":"#REF!"}}]
["2",{"$f":"IF($D8=\"\",\"\",VLOOKUP($D8,'B16 Si Main Draw Prep'!$A$7:$P$70,15))","v":""},{"$f":"IF($D8=\"\",\"\",VLOOKUP($D8,'B16 Si Main Draw Prep'!$A$7:$P$70,16))","v":""},null,"BYE",{"$f":"IF($D8=\"\",\"\",VLOOKUP($D8,'B16 Si Main Draw Prep'!$A$7:$P$70,3))","v":""},null,{"$f":"IF($D8=\"\",\"\",VLOOKUP($D8,'B16 Si Main Draw Prep'!$A$7:$P$70,4))","v":""},"A",null,null,{"$f":"UPPER(IF(OR(K8=\"a\",K8=\"as\"),J7,IF(OR(K8=\"b\",K8=\"bs\"),J9,)))","v":""},null,null,null,null,null,null,null,{"$f":"#REF!","v":{"$error":"#REF!"}}]
["3",{"$f":"IF($D9=\"\",\"\",VLOOKUP($D9,'B16 Si Main Draw Prep'!$A$7:$P$70,15))","v":""},{"$f":"IF($D9=\"\",\"\",VLOOKUP($D9,'B16 Si Main Draw Prep'!$A$7:$P$70,16))","v":""},null,"BYE",{"$f":"IF($D9=\"\",\"\",VLOOKUP($D9,'B16 Si Main Draw Prep'!$A$7:$P$70,3))","v":""},null,{"$f":"IF($D9=\"\",\"\",VLOOKUP($D9,'B16 Si Main Draw Prep'!$A$7:$P$70,4))","v":""},null,{"$f":"UPPER(IF(OR(I10=\"a\",I10=\"as\"),E9,IF(OR(I10=\"b\",I10=\"bs\"),E10,)))","v":"ΠΑΤΡΙΝΕΛΗΣ"},null,null,null,null,null,null,null,null,null,{"$f":"#REF!","v":{"$error":"#REF!"}}]
["4",{"$f":"IF($D10=\"\",\"\",VLOOKUP($D10,'B16 Si Main Draw Prep'!$A$7:$P$70,15))","v":0},{"$f":"IF($D10=\"\",\"\",VLOOKUP($D10,'B16 Si Main Draw Prep'!$A$7:$P$70,16))","v":0},10,{"$f":"UPPER(IF($D10=\"\",\"\",VLOOKUP($D10,'B16 Si Main Draw Prep'!$A$7:$P$70,2)))","v":"ΠΑΤΡΙΝΕΛΗΣ"},{"$f":"IF($D10=\"\",\"\",VLOOKUP($D10,'B16 Si Main Draw Prep'!$A$7:$P$70,3))","v":"ΦΩΤΗΣ"},null,{"$f":"IF($D10=\"\",\"\",VLOOKUP($D10,'B16 Si Main Draw Prep'!$A$7:$P$70,4))","v":0},"B",null,null,"Umpire",null,{"$f":"UPPER(IF(OR(M10=\"a\",M10=\"as\"),L8,IF(OR(M10=\"b\",M10=\"bs\"),L12,)))","v":""},null,null,null,null,null,{"$f":"#REF!","v":{"$error":"#REF!"}}]
["5",{"$f":"IF($D11=\"\",\"\",VLOOKUP($D11,'B16 Si Main Draw Prep'!$A$7:$P$70,15))","v":""},{"$f":"IF($D11=\"\",\"\",VLOOKUP($D11,'B16 Si Main Draw Prep'!$A$7:$P$70,16))","v":""},null,"BYE",{"$f":"IF($D11=\"\",\"\",VLOOKUP($D11,'B16 Si Main Draw Prep'!$A$7:$P$70,3))","v":""},null,{"$f":"IF($D11=\"\",\"\",VLOOKUP($D11,'B16 Si Main Draw Prep'!$A$7:$P$70,4))","v":""},null,{"$f":"UPPER(IF(OR(I12=\"a\",I12=\"as\"),E11,IF(OR(I12=\"b\",I12=\"bs\"),E12,)))","v":"ΜΠΟΖΙΟΣ"},null,null,null,null,null,null,null,null,null,{"$f":"#REF!","v":{"$error":"#REF!"}}]
["6",{"$f":"IF($D12=\"\",\"\",VLOOKUP($D12,'B16 Si Main Draw Prep'!$A$7:$P$70,15))","v":0},{"$f":"IF($D12=\"\",\"\",VLOOKUP($D12,'B16 Si Main Draw Prep'!$A$7:$P$70,16))","v":0},9,{"$f":"UPPER(IF($D12=\"\",\"\",VLOOKUP($D12,'B16 Si Main Draw Prep'!$A$7:$P$70,2)))","v":"ΜΠΟΖΙΟΣ"},{"$f":"IF($D12=\"\",\"\",VLOOKUP($D12,'B16 Si Main Draw Prep'!$A$7:$P$70,3))","v":"ΝΙΚΟΛΑΟΣ"},null,{"$f":"IF($D12=\"\",\"\",VLOOKUP($D12,'B16 Si Main Draw Prep'!$A$7:$P$70,4))","v":0},"B",null,null,{"$f":"UPPER(IF(OR(K12=\"a\",K12=\"as\"),J11,IF(OR(K12=\"b\",K12=\"bs\"),J13,)))","v":""},null,null,null,null,null,null,null,{"$f":"#REF!","v":{"$error":"#REF!"}}]
["7",{"$f":"IF($D13=\"\",\"\",VLOOKUP($D13,'B16 Si Main Draw Prep'!$A$7:$P$70,15))","v":""},{"$f":"IF($D13=\"\",\"\",VLOOKUP($D13,'B16 Si Main Draw Prep'!$A$7:$P$70,16))","v":""},null,"BYE",{"$f":"IF($D13=\"\",\"\",VLOOKUP($D13,'B16 Si Main Draw Prep'!$A$7:$P$70,3))","v":""},null,{"$f":"IF($D13=\"\",\"\",VLOOKUP($D13,'B16 Si Main Draw Prep'!$A$7:$P$70,4))","v":""},null,{"$f":"UPPER(IF(OR(I14=\"a\",I14=\"as\"),E13,IF(OR(I14=\"b\",I14=\"bs\"),E14,)))","v":"ΧΙΩΤΗΣ ΠΑΝΑΓΙΩΤΗΣ"},null,null,null,null,null,null,null,null,null,{"$f":"#REF!","v":{"$error":"#REF!"}}]
["8",{"$f":"IF($D14=\"\",\"\",VLOOKUP($D14,'B16 Si Main Draw Prep'!$A$7:$P$70,15))","v":""},{"$f":"IF($D14=\"\",\"\",VLOOKUP($D14,'B16 Si Main Draw Prep'!$A$7:$P$70,16))","v":""},null,"ΧΙΩΤΗΣ ΠΑΝΑΓΙΩΤΗΣ",{"$f":"IF($D14=\"\",\"\",VLOOKUP($D14,'B16 Si Main Draw Prep'!$A$7:$P$70,3))","v":""},null,{"$f":"IF($D14=\"\",\"\",VLOOKUP($D14,'B16 Si Main Draw Prep'!$A$7:$P$70,4))","v":""},"B",null,null,null,null,"Umpire",null,{"$f":"UPPER(IF(OR(O14=\"a\",O14=\"as\"),N10,IF(OR(O14=\"b\",O14=\"bs\"),N18,)))","v":""},null,null,null,{"$f":"#REF!","v":{"$error":"#REF!"}}]
["9",{"$f":"IF($D15=\"\",\"\",VLOOKUP($D15,'B16 Si Main Draw Prep'!$A$7:$P$70,15))","v":""},{"$f":"IF($D15=\"\",\"\",VLOOKUP($D15,'B16 Si Main Draw Prep'!$A$7:$P$70,16))","v":""},null,"ΖΔΡΑΚΑΣ ΘΑΝΑΣΗΣ",{"$f":"IF($D15=\"\",\"\",VLOOKUP($D15,'B16 Si Main Draw Prep'!$A$7:$P$70,3))","v":""},null,{"$f":"IF($D15=\"\",\"\",VLOOKUP($D15,'B16 Si Main Draw Prep'!$A$7:$P$70,4))","v":""},null,{"$f":"UPPER(IF(OR(I16=\"a\",I16=\"as\"),E15,IF(OR(I16=\"b\",I16=\"bs\"),E16,)))","v":"ΖΔΡΑΚΑΣ ΘΑΝΑΣΗΣ"},null,null,null,null,null,null,null,null,null,{"$f":"#REF!","v":{"$error":"#REF!"}}]
["10",{"$f":"IF($D16=\"\",\"\",VLOOKUP($D16,'B16 Si Main Draw Prep'!$A$7:$P$70,15))","v":""},{"$f":"IF($D16=\"\",\"\",VLOOKUP($D16,'B16 Si Main Draw Prep'!$A$7:$P$70,16))","v":""},null,"BYE",{"$f":"IF($D16=\"\",\"\",VLOOKUP($D16,'B16 Si Main Draw Prep'!$A$7:$P$70,3))","v":""},null,{"$f":"IF($D16=\"\",\"\",VLOOKUP($D16,'B16 Si Main Draw Prep'!$A$7:$P$70,4))","v":""},"A",null,null,{"$f":"UPPER(IF(OR(K16=\"a\",K16=\"as\"),J15,IF(OR(K16=\"b\",K16=\"bs\"),J17,)))","v":""},null,null,null,null,null,null,null,{"$f":"#REF!","v":{"$error":"#REF!"}}]
["11",{"$f":"IF($D17=\"\",\"\",VLOOKUP($D17,'B16 Si Main Draw Prep'!$A$7:$P$70,15))","v":0},{"$f":"IF($D17=\"\",\"\",VLOOKUP($D17,'B16 Si Main Draw Prep'!$A$7:$P$70,16))","v":0},30,{"$f":"UPPER(IF($D17=\"\",\"\",VLOOKUP($D17,'B16 Si Main Draw Prep'!$A$7:$P$70,2)))","v":"ΠΑΠΑΝΙΚΟΛΑΟΥ"},{"$f":"IF($D17=\"\",\"\",VLOOKUP($D17,'B16 Si Main Draw Prep'!$A$7:$P$70,3))","v":"ΝΤΥΛΑΝ"},null,{"$f":"IF($D17=\"\",\"\",VLOOKUP($D17,'B16 Si Main Draw Prep'!$A$7:$P$70,4))","v":0},null,{"$f":"UPPER(IF(OR(I18=\"a\",I18=\"as\"),E17,IF(OR(I18=\"b\",I18=\"bs\"),E18,)))","v":"ΠΑΠΑΝΙΚΟΛΑΟΥ"}]
["12",{"$f":"IF($D18=\"\",\"\",VLOOKUP($D18,'B16 Si Main Draw Prep'!$A$7:$P$70,15))","v":""},{"$f":"IF($D18=\"\",\"\",VLOOKUP($D18,'B16 Si Main Draw Prep'!$A$7:$P$70,16))","v":""},null,"BYE",{"$f":"IF($D18=\"\",\"\",VLOOKUP($D18,'B16 Si Main Draw Prep'!$A$7:$P$70,3))","v":""},null,{"$f":"IF($D18=\"\",\"\",VLOOKUP($D18,'B16 Si Main Draw Prep'!$A$7:$P$70,4))","v":""},"A",null,null,"Umpire",null,{"$f":"UPPER(IF(OR(M18=\"a\",M18=\"as\"),L16,IF(OR(M18=\"b\",M18=\"bs\"),L20,)))","v":""}]
["13",{"$f":"IF($D19=\"\",\"\",VLOOKUP($D19,'B16 Si Main Draw Prep'!$A$7:$P$70,15))","v":""},{"$f":"IF($D19=\"\",\"\",VLOOKUP($D19,'B16 Si Main Draw Prep'!$A$7:$P$70,16))","v":""},null,"BYE",{"$f":"IF($D19=\"\",\"\",VLOOKUP($D19,'B16 Si Main Draw Prep'!$A$7:$P$70,3))","v":""},null,{"$f":"IF($D19=\"\",\"\",VLOOKUP($D19,'B16 Si Main Draw Prep'!$A$7:$P$70,4))","v":""},null,{"$f":"UPPER(IF(OR(I20=\"a\",I20=\"as\"),E19,IF(OR(I20=\"b\",I20=\"bs\"),E20,)))","v":"ΔΟΥΚΟΥΜΟΠΟΥΛΟΣ"}]
["14",{"$f":"IF($D20=\"\",\"\",VLOOKUP($D20,'B16 Si Main Draw Prep'!$A$7:$P$70,15))","v":0},{"$f":"IF($D20=\"\",\"\",VLOOKUP($D20,'B16 Si Main Draw Prep'!$A$7:$P$70,16))","v":0},24,{"$f":"UPPER(IF($D20=\"\",\"\",VLOOKUP($D20,'B16 Si Main Draw Prep'!$A$7:$P$70,2)))","v":"ΔΟΥΚΟΥΜΟΠΟΥΛΟΣ"},{"$f":"IF($D20=\"\",\"\",VLOOKUP($D20,'B16 Si Main Draw Prep'!$A$7:$P$70,3))","v":"ΔΗΜΗΤΡΙΟΣ"},null,{"$f":"IF($D20=\"\",\"\",VLOOKUP($D20,'B16 Si Main Draw Prep'!$A$7:$P$70,4))","v":0},"B",null,null,{"$f":"UPPER(IF(OR(K20=\"a\",K20=\"as\"),J19,IF(OR(K20=\"b\",K20=\"bs\"),J21,)))","v":""}]
["15",{"$f":"IF($D21=\"\",\"\",VLOOKUP($D21,'B16 Si Main Draw Prep'!$A$7:$P$70,15))","v":""},{"$f":"IF($D21=\"\",\"\",VLOOKUP($D21,'B16 Si Main Draw Prep'!$A$7:$P$70,16))","v":""},null,"BYE",{"$f":"IF($D21=\"\",\"\",VLOOKUP($D21,'B16 Si Main Draw Prep'!$A$7:$P$70,3))","v":""},null,{"$f":"IF($D21=\"\",\"\",VLOOKUP($D21,'B16 Si Main Draw Prep'!$A$7:$P$70,4))","v":""},null,{"$f":"UPPER(IF(OR(I22=\"a\",I22=\"as\"),E21,IF(OR(I22=\"b\",I22=\"bs\"),E22,)))","v":"ΓΕΡΟΔΗΜΟΣ ΑΠΟΣΤΟΛΟΣ"}]
["16",{"$f":"IF($D22=\"\",\"\",VLOOKUP($D22,'B16 Si Main Draw Prep'!$A$7:$P$70,15))","v":""},{"$f":"IF($D22=\"\",\"\",VLOOKUP($D22,'B16 Si Main Draw Prep'!$A$7:$P$70,16))","v":""},null,"ΓΕΡΟΔΗΜΟΣ ΑΠΟΣΤΟΛΟΣ",{"$f":"IF($D22=\"\",\"\",VLOOKUP($D22,'B16 Si Main Draw Prep'!$A$7:$P$70,3))","v":""},null,{"$f":"IF($D22=\"\",\"\",VLOOKUP($D22,'B16 Si Main Draw Prep'!$A$7:$P$70,4))","v":""},"B",null,null,null,null,"Finalist 1:",null,{"$f":"UPPER(IF(OR(O23=\"a\",O23=\"as\"),P14,IF(OR(O23=\"b\",O23=\"bs\"),P30,)))","v":""}]
["17",{"$f":"IF($D23=\"\",\"\",VLOOKUP($D23,'B16 Si Main Draw Prep'!$A$7:$P$70,15))","v":""},{"$f":"IF($D23=\"\",\"\",VLOOKUP($D23,'B16 Si Main Draw Prep'!$A$7:$P$70,16))","v":""},null,"ΚΑΡΕΛΑΣ ΠΑΝΑΓΙΩΤΗΣ",{"$f":"IF($D23=\"\",\"\",VLOOKUP($D23,'B16 Si Main Draw Prep'!$A$7:$P$70,3))","v":""},null,{"$f":"IF($D23=\"\",\"\",VLOOKUP($D23,'B16 Si Main Draw Prep'!$A$7:$P$70,4))","v":""},null,{"$f":"UPPER(IF(OR(I24=\"a\",I24=\"as\"),E23,IF(OR(I24=\"b\",I24=\"bs\"),E24,)))","v":"ΚΑΡΕΛΑΣ ΠΑΝΑΓΙΩΤΗΣ"},null,null,null,"Umpire"]
["18",{"$f":"IF($D24=\"\",\"\",VLOOKUP($D24,'B16 Si Main Draw Prep'!$A$7:$P$70,15))","v":""},{"$f":"IF($D24=\"\",\"\",VLOOKUP($D24,'B16 Si Main Draw Prep'!$A$7:$P$70,16))","v":""},null,"BYE",{"$f":"IF($D24=\"\",\"\",VLOOKUP($D24,'B16 Si Main Draw Prep'!$A$7:$P$70,3))","v":""},null,{"$f":"IF($D24=\"\",\"\",VLOOKUP($D24,'B16 Si Main Draw Prep'!$A$7:$P$70,4))","v":""},"A",null,null,{"$f":"UPPER(IF(OR(K24=\"a\",K24=\"as\"),J23,IF(OR(K24=\"b\",K24=\"bs\"),J25,)))","v":""}]
["19",{"$f":"IF($D25=\"\",\"\",VLOOKUP($D25,'B16 Si Main Draw Prep'!$A$7:$P$70,15))","v":0},{"$f":"IF($D25=\"\",\"\",VLOOKUP($D25,'B16 Si Main Draw Prep'!$A$7:$P$70,16))","v":0},20,{"$f":"UPPER(IF($D25=\"\",\"\",VLOOKUP($D25,'B16 Si Main Draw Prep'!$A$7:$P$70,2)))","v":"ΚΑΤΣΙΧΤΗΣ"},{"$f":"IF($D25=\"\",\"\",VLOOKUP($D25,'B16 Si Main Draw Prep'!$A$7:$P$70,3))","v":"ΠΑΝΑΓΙΩΤΗΣ"},null,{"$f":"IF($D25=\"\",\"\",VLOOKUP($D25,'B16 Si Main Draw Prep'!$A$7:$P$70,4))","v":0},null,{"$f":"UPPER(IF(OR(I26=\"a\",I26=\"as\"),E25,IF(OR(I26=\"b\",I26=\"bs\"),E26,)))","v":""}]
["20",{"$f":"IF($D26=\"\",\"\",VLOOKUP($D26,'B16 Si Main Draw Prep'!$A$7:$P$70,15))","v":0},{"$f":"IF($D26=\"\",\"\",VLOOKUP($D26,'B16 Si Main Draw Prep'!$A$7:$P$70,16))","v":0},31,{"$f":"UPPER(IF($D26=\"\",\"\",VLOOKUP($D26,'B16 Si Main Draw Prep'!$A$7:$P$70,2)))","v":"ΤΣΟΥΚΛΕΡΗΣ"},{"$f":"IF($D26=\"\",\"\",VLOOKUP($D26,'B16 Si Main Draw Prep'!$A$7:$P$70,3))","v":"ΓΙΩΡΓΟΣ"},null,{"$f":"IF($D26=\"\",\"\",VLOOKUP($D26,'B16 Si Main Draw Prep'!$A$7:$P$70,4))","v":0},null,null,null,"Umpire",null,{"$f":"UPPER(IF(OR(M26=\"a\",M26=\"as\"),L24,IF(OR(M26=\"b\",M26=\"bs\"),L28,)))","v":""}]
["21",{"$f":"IF($D27=\"\",\"\",VLOOKUP($D27,'B16 Si Main Draw Prep'!$A$7:$P$70,15))","v":""},{"$f":"IF($D27=\"\",\"\",VLOOKUP($D27,'B16 Si Main Draw Prep'!$A$7:$P$70,16))","v":""},null,"BYE",{"$f":"IF($D27=\"\",\"\",VLOOKUP($D27,'B16 Si Main Draw Prep'!$A$7:$P$70,3))","v":""},null,{"$f":"IF($D27=\"\",\"\",VLOOKUP($D27,'B16 Si Main Draw Prep'!$A$7:$P$70,4))","v":""},null,{"$f":"UPPER(IF(OR(I28=\"a\",I28=\"as\"),E27,IF(OR(I28=\"b\",I28=\"bs\"),E28,)))","v":"ΠΑΠΑΓΕΩΡΓΙΟΥ"}]
["22",{"$f":"IF($D28=\"\",\"\",VLOOKUP($D28,'B16 Si Main Draw Prep'!$A$7:$P$70,15))","v":0},{"$f":"IF($D28=\"\",\"\",VLOOKUP($D28,'B16 Si Main Draw Prep'!$A$7:$P$70,16))","v":0},1,{"$f":"UPPER(IF($D28=\"\",\"\",VLOOKUP($D28,'B16 Si Main Draw Prep'!$A$7:$P$70,2)))","v":"ΠΑΠΑΓΕΩΡΓΙΟΥ"},{"$f":"IF($D28=\"\",\"\",VLOOKUP($D28,'B16 Si Main Draw Prep'!$A$7:$P$70,3))","v":"ΔΗΜΗΤΡΙΟΣ"},null,{"$f":"IF($D28=\"\",\"\",VLOOKUP($D28,'B16 Si Main Draw Prep'!$A$7:$P$70,4))","v":0},"B",null,null,{"$f":"UPPER(IF(OR(K28=\"a\",K28=\"as\"),J27,IF(OR(K28=\"b\",K28=\"bs\"),J29,)))","v":""}]
["23",{"$f":"IF($D29=\"\",\"\",VLOOKUP($D29,'B16 Si Main Draw Prep'!$A$7:$P$70,15))","v":""},{"$f":"IF($D29=\"\",\"\",VLOOKUP($D29,'B16 Si Main Draw Prep'!$A$7:$P$70,16))","v":""},null,"BYE",{"$f":"IF($D29=\"\",\"\",VLOOKUP($D29,'B16 Si Main Draw Prep'!$A$7:$P$70,3))","v":""},null,{"$f":"IF($D29=\"\",\"\",VLOOKUP($D29,'B16 Si Main Draw Prep'!$A$7:$P$70,4))","v":""},null,{"$f":"UPPER(IF(OR(I30=\"a\",I30=\"as\"),E29,IF(OR(I30=\"b\",I30=\"bs\"),E30,)))","v":"ΛΑΛΟΥΣΗΣ ΚΟΣΜΑΣ"}]
["24",{"$f":"IF($D30=\"\",\"\",VLOOKUP($D30,'B16 Si Main Draw Prep'!$A$7:$P$70,15))","v":""},{"$f":"IF($D30=\"\",\"\",VLOOKUP($D30,'B16 Si Main Draw Prep'!$A$7:$P$70,16))","v":""},null,"ΛΑΛΟΥΣΗΣ ΚΟΣΜΑΣ",{"$f":"IF($D30=\"\",\"\",VLOOKUP($D30,'B16 Si Main Draw Prep'!$A$7:$P$70,3))","v":""},null,{"$f":"IF($D30=\"\",\"\",VLOOKUP($D30,'B16 Si Main Draw Prep'!$A$7:$P$70,4))","v":""},"B",null,null,null,null,"Umpire",null,{"$f":"UPPER(IF(OR(O30=\"a\",O30=\"as\"),N26,IF(OR(O30=\"b\",O30=\"bs\"),N34,)))","v":""}]
["25",{"$f":"IF($D31=\"\",\"\",VLOOKUP($D31,'B16 Si Main Draw Prep'!$A$7:$P$70,15))","v":""},{"$f":"IF($D31=\"\",\"\",VLOOKUP($D31,'B16 Si Main Draw Prep'!$A$7:$P$70,16))","v":""},null,"ΑΝΑΣΤΟΠΟΥΛΟΣ ΠΑΝΑΓΙΩΤΗΣ",{"$f":"IF($D31=\"\",\"\",VLOOKUP($D31,'B16 Si Main Draw Prep'!$A$7:$P$70,3))","v":""},null,{"$f":"IF($D31=\"\",\"\",VLOOKUP($D31,'B16 Si Main Draw Prep'!$A$7:$P$70,4))","v":""},null,{"$f":"UPPER(IF(OR(I32=\"a\",I32=\"as\"),E31,IF(OR(I32=\"b\",I32=\"bs\"),E32,)))","v":"ΑΝΑΣΤΟΠΟΥΛΟΣ ΠΑΝΑΓΙΩΤΗΣ"}]
["26",{"$f":"IF($D32=\"\",\"\",VLOOKUP($D32,'B16 Si Main Draw Prep'!$A$7:$P$70,15))","v":""},{"$f":"IF($D32=\"\",\"\",VLOOKUP($D32,'B16 Si Main Draw Prep'!$A$7:$P$70,16))","v":""},null,"BYE",{"$f":"IF($D32=\"\",\"\",VLOOKUP($D32,'B16 Si Main Draw Prep'!$A$7:$P$70,3))","v":""},null,{"$f":"IF($D32=\"\",\"\",VLOOKUP($D32,'B16 Si Main Draw Prep'!$A$7:$P$70,4))","v":""},"A",null,null,{"$f":"UPPER(IF(OR(K32=\"a\",K32=\"as\"),J31,IF(OR(K32=\"b\",K32=\"bs\"),J33,)))","v":""}]
["27",{"$f":"IF($D33=\"\",\"\",VLOOKUP($D33,'B16 Si Main Draw Prep'!$A$7:$P$70,15))","v":0},{"$f":"IF($D33=\"\",\"\",VLOOKUP($D33,'B16 Si Main Draw Prep'!$A$7:$P$70,16))","v":0},16,{"$f":"UPPER(IF($D33=\"\",\"\",VLOOKUP($D33,'B16 Si Main Draw Prep'!$A$7:$P$70,2)))","v":"ΓΙΑΝΝΟΠΟΥΛΟΣ"},{"$f":"IF($D33=\"\",\"\",VLOOKUP($D33,'B16 Si Main Draw Prep'!$A$7:$P$70,3))","v":"ΒΑΣΙΛΗΣ"},null,{"$f":"IF($D33=\"\",\"\",VLOOKUP($D33,'B16 Si Main Draw Prep'!$A$7:$P$70,4))","v":0},null,{"$f":"UPPER(IF(OR(I34=\"a\",I34=\"as\"),E33,IF(OR(I34=\"b\",I34=\"bs\"),E34,)))","v":"ΓΙΑΝΝΟΠΟΥΛΟΣ"}]
["28",{"$f":"IF($D34=\"\",\"\",VLOOKUP($D34,'B16 Si Main Draw Prep'!$A$7:$P$70,15))","v":""},{"$f":"IF($D34=\"\",\"\",VLOOKUP($D34,'B16 Si Main Draw Prep'!$A$7:$P$70,16))","v":""},null,"BYE",{"$f":"IF($D34=\"\",\"\",VLOOKUP($D34,'B16 Si Main Draw Prep'!$A$7:$P$70,3))","v":""},null,{"$f":"IF($D34=\"\",\"\",VLOOKUP($D34,'B16 Si Main Draw Prep'!$A$7:$P$70,4))","v":""},"A",null,null,"Umpire",null,{"$f":"UPPER(IF(OR(M34=\"a\",M34=\"as\"),L32,IF(OR(M34=\"b\",M34=\"bs\"),L36,)))","v":""}]
["29",{"$f":"IF($D35=\"\",\"\",VLOOKUP($D35,'B16 Si Main Draw Prep'!$A$7:$P$70,15))","v":""},{"$f":"IF($D35=\"\",\"\",VLOOKUP($D35,'B16 Si Main Draw Prep'!$A$7:$P$70,16))","v":""},null,"BYE",{"$f":"IF($D35=\"\",\"\",VLOOKUP($D35,'B16 Si Main Draw Prep'!$A$7:$P$70,3))","v":""},null,{"$f":"IF($D35=\"\",\"\",VLOOKUP($D35,'B16 Si Main Draw Prep'!$A$7:$P$70,4))","v":""},null,{"$f":"UPPER(IF(OR(I36=\"a\",I36=\"as\"),E35,IF(OR(I36=\"b\",I36=\"bs\"),E36,)))","v":"ΑΝΑΣΤΟΠΟΥΛΟΣ"}]
["30",{"$f":"IF($D36=\"\",\"\",VLOOKUP($D36,'B16 Si Main Draw Prep'!$A$7:$P$70,15))","v":0},{"$f":"IF($D36=\"\",\"\",VLOOKUP($D36,'B16 Si Main Draw Prep'!$A$7:$P$70,16))","v":0},6,{"$f":"UPPER(IF($D36=\"\",\"\",VLOOKUP($D36,'B16 Si Main Draw Prep'!$A$7:$P$70,2)))","v":"ΑΝΑΣΤΟΠΟΥΛΟΣ"},{"$f":"IF($D36=\"\",\"\",VLOOKUP($D36,'B16 Si Main Draw Prep'!$A$7:$P$70,3))","v":"ΝΙΚΟΛΑΟΣ"},null,{"$f":"IF($D36=\"\",\"\",VLOOKUP($D36,'B16 Si Main Draw Prep'!$A$7:$P$70,4))","v":0},"B",null,null,{"$f":"UPPER(IF(OR(K36=\"a\",K36=\"as\"),J35,IF(OR(K36=\"b\",K36=\"bs\"),J37,)))","v":""},null,"Final",null,"Winner"]
["31",{"$f":"IF($D37=\"\",\"\",VLOOKUP($D37,'B16 Si Main Draw Prep'!$A$7:$P$70,15))","v":""},{"$f":"IF($D37=\"\",\"\",VLOOKUP($D37,'B16 Si Main Draw Prep'!$A$7:$P$70,16))","v":""},null,"BYE",{"$f":"IF($D37=\"\",\"\",VLOOKUP($D37,'B16 Si Main Draw Prep'!$A$7:$P$70,3))","v":""},null,{"$f":"IF($D37=\"\",\"\",VLOOKUP($D37,'B16 Si Main Draw Prep'!$A$7:$P$70,4))","v":""},null,{"$f":"UPPER(IF(OR(I38=\"a\",I38=\"as\"),E37,IF(OR(I38=\"b\",I38=\"bs\"),E38,)))","v":"ΛΕΡΙΚΟΣ ΑΡΗΣ"},null,null,null,{"$f":"UPPER(IF(OR(O23=\"a\",O23=\"as\"),P14,IF(OR(O23=\"b\",O23=\"bs\"),P30,)))","v":""}]
["32",{"$f":"IF($D38=\"\",\"\",VLOOKUP($D38,'B16 Si Main Draw Prep'!$A$7:$P$70,15))","v":""},{"$f":"IF($D38=\"\",\"\",VLOOKUP($D38,'B16 Si Main Draw Prep'!$A$7:$P$70,16))","v":""},null,"ΛΕΡΙΚΟΣ ΑΡΗΣ",{"$f":"IF($D38=\"\",\"\",VLOOKUP($D38,'B16 Si Main Draw Prep'!$A$7:$P$70,3))","v":""},null,{"$f":"IF($D38=\"\",\"\",VLOOKUP($D38,'B16 Si Main Draw Prep'!$A$7:$P$70,4))","v":""},"B",null,null,null,null,"Umpire",null,{"$f":"UPPER(IF(OR(O38=\"a\",O38=\"as\"),N37,IF(OR(O38=\"b\",O38=\"bs\"),N39,)))","v":""}]
["33",{"$f":"IF($D39=\"\",\"\",VLOOKUP($D39,'B16 Si Main Draw Prep'!$A$7:$P$70,15))","v":""},{"$f":"IF($D39=\"\",\"\",VLOOKUP($D39,'B16 Si Main Draw Prep'!$A$7:$P$70,16))","v":""},null,"ΛΑΜΠΡΟΠΟΥΛΟΣ ΚΛΕΜ",{"$f":"IF($D39=\"\",\"\",VLOOKUP($D39,'B16 Si Main Draw Prep'!$A$7:$P$70,3))","v":""},null,{"$f":"IF($D39=\"\",\"\",VLOOKUP($D39,'B16 Si Main Draw Prep'!$A$7:$P$70,4))","v":""},null,{"$f":"UPPER(IF(OR(I40=\"a\",I40=\"as\"),E39,IF(OR(I40=\"b\",I40=\"bs\"),E40,)))","v":"ΛΑΜΠΡΟΠΟΥΛΟΣ ΚΛΕΜ"},null,null,null,{"$f":"UPPER(IF(OR(O55=\"a\",O55=\"as\"),P46,IF(OR(O55=\"b\",O55=\"bs\"),P62,)))","v":""}]
["34",{"$f":"IF($D40=\"\",\"\",VLOOKUP($D40,'B16 Si Main Draw Prep'!$A$7:$P$70,15))","v":""},{"$f":"IF($D40=\"\",\"\",VLOOKUP($D40,'B16 Si Main Draw Prep'!$A$7:$P$70,16))","v":""},null,"BYE",{"$f":"IF($D40=\"\",\"\",VLOOKUP($D40,'B16 Si Main Draw Prep'!$A$7:$P$70,3))","v":""},null,{"$f":"IF($D40=\"\",\"\",VLOOKUP($D40,'B16 Si Main Draw Prep'!$A$7:$P$70,4))","v":""},"A",null,null,{"$f":"UPPER(IF(OR(K40=\"a\",K40=\"as\"),J39,IF(OR(K40=\"b\",K40=\"bs\"),J41,)))","v":""}]
{"$rows_left_out":40}